crmsci
type: Ontology
version IRI: http://www.cidoc-crm.org/extensions/crmsci/3.2/
imports: http://www.cidoc-crm.org/cidoc-crm/7.1.3/
imports: http://www.cidoc-crm.org/extensions/crminf/1.2.1/
version info: CRMsci Ontology 3.2 (May, 2026) including references to CIDOC-CRM 7.1.3 and CRMinf 1.2.1
comment: The Scientific Observation Model (CRMsci) is a formal ontology intended to be used as a global schema for integrating metadata about scientific observation, measurements and processed data in descriptive and empirical sciences such as biodiversity, geology, geography, archaeology, cultural heritage conservation and others in research IT environments and research data libraries. Its primary purpose is facilitating the management, integration, mediation, interchange and access to research data by description of semantic relationships, in particular causal ones. It is not primarily a model to process the data themselves in order to produce new research results, even though its representations offer themselves to be used for some kind of processing.

Matter Removal
type: Class
comment: This class comprises the activities that result in an instance of S10 Material Substantial being decreased by the removal of an amount of matter. Typical scenarios include the removal of a component or piece of a physical object, removal of an archaeological or geological layer, taking a tissue sample from a body or a sample of fluid from a body of water. The removed matter may acquire a persistent identity of different nature beyond the act of its removal, such as becoming a physical object in the narrower sense. Such cases should be modelled by using multiple instantiation with adequate concepts of creating the respective items.
subclass of: E7 Activity

Sample Taking
type: Class
comment: This class comprises the activity that results in taking an amount of matter as sample for further analysis from a material substantial such as a body of water, a geological formation, or an archaeological object. The removed matter may acquire a persistent identity of different nature beyond the act of its removal, such as becoming a physical object in the narrower sense. The sample is typically removed from a physical feature which is used as a frame of reference, the place of sampling. In case of a non-rigid Material Substantial, the source of sampling need not be modified by the activity of sample taking.
subclass of: Matter Removal

Measurement by Sampling
type: Class
comment: This class comprises activities of taking a sample and measuring or analysing it as one unit of activity, in which the sample is typically not identified and preserved beyond the context of this activity. Instances of this class describe the taking of one or more samples regardless whether they are explicitly identified in documentation or preserved beyond this activity. The dimensions observed by the respective measurement of this particular sample are regarded as dimensions of the instance of S10 Material Substantial at the place from which the samples were taken. Therefore, the class S3 Measurement by Sampling inherits the properties of S2 Sample Taking O3 sampled from (was sample by) : S10 Material Substantial and O4 sampled at (was sampling location of) : E53 Place, and the properties of S21 Measurement O24 measured (was measured by) : S15 Observable Entity. It needs not instantiate the properties O5 removed (was removed by) : S13 Sample and O24 measured (was measured by) : S15 Observable Entity, if the sample is not documented beyond the context of the activity.
subclass of: Measurement
subclass of: Sample Taking

Single Observation
type: Class
comment: This class comprises the activity of gaining scientific knowledge about particular states of physical reality through empirical evidence, experiments, or measurements, for cases in which the observed knowledge can be described by a single binary proposition relating one instance of S15 Observable Entity to some instance of E1 CRM Entity.
subclass of: E13 Attribute Assignment
subclass of: Observation

Inference Making
type: Class
comment: This class comprises the action of making propositions and statements about particular states of affairs, in reality or in possible realities, or categorical descriptions of reality by using inferences from other statements based on hypotheses and any form of formal or informal logic. It includes evaluations, calculations, and interpretations based on mathematical formulations and propositions.
subclass of: I1 Argumentation

Data Evaluation
type: Class
comment: This class comprises the action of concluding propositions on a respective reality from observational data by making evaluations based on mathematical inference rules and calculations using established hypotheses, such as the calculation of an earthquake epicentre. S6 Data Evaluation is distinct from both S21 Measurement and E16 Measurement; Secondary derivations of dimensions of an object from data measured by different processes are regarded as S6 Data Evaluation and not determining instances of Measurement in its own right. For instance, the volume of a statue concluded from a 3D model is an instance of S6 Data Evaluation and not of Measurement.
subclass of: Inference Making

Simulation or Prediction
type: Class
comment: This class comprises activities of executing algorithms or software for simulating the behaviour and the properties of a system of interacting components that form part of reality or not by using a mathematical model of the respective interactions. In particular, it implies making predictions about the future behaviours of a system of interacting components of reality by starting simulation from an actually observed state, such as weather forecasts. Simulations may also be used to understand the effects of a theory, to compare theoretical predictions with reality, or to show differences with another theory.
subclass of: Inference Making

Categorical Hypothesis Building
type: Class
comment: This class comprises the action of making categorical hypotheses based on inference rules and theories; By categorical hypotheses we mean assumptions about the kinds of interactions and related kinds of structures of a domain that have the character of “laws” of nature or human behaviour, be it necessary or probabilistic. Categorical hypotheses are developed by “induction” from finite numbers of observations and the absence of observations of some particular kind. As such, categorical hypotheses are always subject to falsification by new evidence. Instances of S8 Categorical Hypothesis Building include making and questioning categorical hypotheses.
subclass of: Inference Making

Property Type
type: Class
comment: This class comprises properties. Typically, instances of S9 Property Type would be taken from an ontology or terminological system. In particular, instances of this class can be used to describe in a parametric way what kind of properties the values in scientific data sets are about. By virtue of such descriptions, numeric data can be interpreted as sets of propositions in terms of a formal ontology, such as “concentration of nitrate”, observed in the ground water from a certain borehole.
subclass of: E55 Type

Material Substantial
type: Class
comment: This class comprises constellations of matter with a relative stability of any form sufficient to associate them with a persistent identity, such as being confined to certain extent, having a relative stability of form or structure, or containing a fixed amount of matter. In particular, it comprises physical things in the narrower sense and fluid bodies. It is an abstraction of physical substance for solid and non-solid things of matter.
subclass of: E70 Thing
subclass of: Observable Entity

Amount of Matter
type: Class
comment: This class comprises fixed amounts of matter specified as some air, some water, some soil, etc., defined by the total and integrity of their material content. In order to be able to identify and recognize in practice one instance of S11 Amount of Matter, some sort of confinement is needed that serves as a constraint for the enclosed matter and the integrity of the content, such as a bottle. In contrast to instances of E18 Physical Thing, no stability of form is required. The content may be put into another bottle without losing its identity. Subclasses may define very different identity conditions for the integrity of the content, such as chemical composition, or the sequence of layers of a bore core. Whereas an instance of E18 Physical Thing may gradually change form and chemical composition while preserving its identity, such as living beings, an instance of S11 Amount of Matter may lose its identifying features by such processes. What matters for the identity of an instance of S1 Amount of Matter is the preservation of a relevant composition from the initial state of definition onwards.
subclass of: Material Substantial

Amount of Fluid
type: Class
comment: This class comprises fixed amounts of fluid (be they gas or liquid) defined by the total of its material content, typically molecules. They frequently acquire identity in laboratory practice by the fact of being kept or handled together within some adequate containers.
subclass of: Amount of Matter
subclass of: Fluid Body

Sample
type: Class
comment: This class comprises instances of S11 Amount of Matter taken from some instance of S10 Material Substantial with the intention to be representative for some material qualities of the instance of S10 Material Substantial or part of it was taken for further analysis. We typically regard a sample as ceasing to exist when the respective representative qualities become corrupted, such as the purity of a water sample or the layering of a bore core.
subclass of: Amount of Matter

Fluid Body
type: Class
comment: This class comprises a mass of matter in fluid form environmentally constraint in some persistent form allowing for identifying it for the management or research of material phenomena, such as a part of the sea, a river, the atmosphere or the milk in a bottle. Fluids are generally defined by the continuity criterion which is characteristic of their substance: their amorphous matter is continuous and tends to flow. Therefore, contiguous amounts of matter within a fluid body may stay contiguous or at least be locally spatially confined for a sufficiently long time in order to be temporarily identified and traced. This is a much weaker concept of stability of form than the one we would apply to what one would call a physical object. In general, an instance of Fluid Body may gain or lose matter over time through so-called sources or sinks in its surface, in contrast to physical things, which may lose or gain matter by exchange of pieces such as spare parts or corrosion.
subclass of: Material Substantial

Observable Entity
type: Class
comment: This class comprises instances of E5 Event or S10 Material Substantial (i.e. items or phenomena, such as physical things, their behaviour, states and interactions or events), that can be observed by measurement or detection devices or by human sensory impression including when enhanced by tools. In order to be observable, instances of E5 Event must consist of some interaction or action of material substance. In some cases, the spatiotemporal confinement of the event itself, such as a flash, a car stopping etc. marks the limits of a documented observation of an event. In other cases, such as the situation of a car passing by a certain object, the spatiotemporal limits of the event of observing itself, as well as the direction of attention or the orientation of used instruments, may constrain the observed detail of a larger process, e.g., noticing the sight of a car passing by; a light emission, etc. Conceptual objects manifest through their carriers such as books, digital media, or even human memory. Attributes of conceptual objects, such as number of words, can be observed on their carriers. If the respective properties between carriers differ, either they carry different instances of conceptual objects or the difference can be attributed to accidental deficiencies in one of the carriers. In that sense, even immaterial objects are observable. By this model we address the fact that frequently, the actually observed carriers of conceptual objects are not explicitly identified in documentation, i.e., they are assumed to have existed but they are unknown as individuals.
subclass of: E1 CRM Entity

Physical Genesis
type: Class
comment: This class comprises events or processes that result in (generate) physical things, man-made or natural, coming into being in the form by which they are later identified. The creation of a new physical item, at the same time, can be a result of an alteration (modification) – it can become a new thing due to an alteration activity.
subclass of: E63 Beginning of Existence
subclass of: Alteration

Alteration
type: Class
comment: This class comprises natural events or man-made processes that create, alter or change physical things, by affecting permanently their form or consistency without changing their identity. Examples include alterations on depositional features-layers by natural factors or disturbance by roots or insects, organic alterations, petrification, etc.
subclass of: E5 Event

Encounter Event
type: Class
comment: This class comprises activities of Observation (S27) (substance) where an Actor (E39) encounters an instance of E18 Physical Thing, of a kind relevant for the mission of the observation or regarded as potentially relevant for some community (identity). This observation produces knowledge about the existence of the respective thing at particular place in, or on, surrounding matter. This knowledge may be new to the group of people the actor belongs to. In that case, we would talk about discovery. The observer may recognize or assign an individual identity of the thing encountered, or regard only the type as noteworthy in the associated documentation or report. In Archaeology, there is a particular interest if an object is found “in situ”, i.e., if its embedding in the surrounding matter supports the assumption that the object was not moved since the archaeologically relevant deposition event. The surrounding matter with the relative position of the object in it, as well as the absolute position and time of the observation may be recorded to enable inferences about the history of the object. In Biology, additional parameters may be recorded – like the kind of ecosystem, if the biological individual survives the observation, what detection or catching devices have been used, or if the encounter event supported the detection of a new biological kind (“taxon”).
subclass of: Observation

Rigid Physical Feature
type: Class
comment: Any instance of this class is a physical feature with sufficient stability of form, in itself and with respect to the physical object bearing it, in order to associate a permanent reference space within which its form is invariant and at rest. The maximum volume in space that an instance of S20 Rigid Physical Feature occupies defines uniquely a place for the feature with respect to its surrounding matter. Therefore, we model S20 Rigid Physical Feature as a subclass of E26 Physical Feature and of E53 Place. The latter is intended as a phenomenal place as defined in CRMgeo (Doerr and Hiebel 2013). By virtue of this multiple inheritance, we can discuss positions relative to the extent of an instance of S20 Rigid Physical Feature without representing each instance of it together with an instance of its associated place. However, since the identity and existence of this place depends uniquely on the identity of the instance of S20 Rigid Physical Feature as matter, this multiple inheritance is unambiguous and effective and furthermore corresponds to the intuitions of natural language. It shortcuts an implicit self-referential path from E26 Physical Feature through P156 occupies (is occupied by) , E53 Place , P157 is at rest relative to (provides reference space for) , to E26 Physical Feature. In cases of instances of S20 Rigid Physical Feature on or in the surface of earth, the default reference is typically fixed to the closer environment of the tectonic plate or sea floor. In cases of features on mobile objects, the reference space is typically fixed to the geometry of the bearing object. Note that the reference space associated with the instance of S20 Rigid Physical Feature may quite well be deformed over time, as long the continuity of its topology does not become unclear, such as the compression of dinosaur bones in geological layers, or the distortions of the hull of a ship by the waves of the sea. Defined in this way, the reference space can be used as a means to …
subclass of: E26 Physical Feature
subclass of: E53 Place

Measurement
type: Class
comment: This class comprises actions measuring instances of S15 Observable Entity, properties of physical things, or phenomena, states and interactions or events, that can be determined by a systematic procedure. Primary data from measurement devices are regarded to be results of an observation process.
subclass of: Observation

Segment of Matter
type: Class
comment: This class comprises physical features with relative stability of form and structure within a declared spatial volume of interest. The spatial extent of an instance of S22 Segment of Matter may be declared or defined by a researcher or observer usually because the arrangement and composition of substance is characteristic for the surrounding matter or can be interpreted as traces of its genesis and subsequent internal and external processes it was exposed to. The defining spatial extent is typically declared on a continuous matter by means of geometric determination without observable boundaries on all sides or any side. It may however be extracted at some point in time along the declared boundaries. An instance of S22 Segment of Matter is regarded to be existing from the time on it completely solidified with a structure that is still preserved in a recognizable way at the time of its spatial definition. Its existence is regarded to end when its respective integrity is partially or completely corrupted. Uncorrupted subsections of an instance of S22 Segment of Matter may continue to exist as segments of matter in their own right beyond the existence of the containing instance, and may have solidified before it. Typical examples are segments of archaeological or geological layers. They are regarded as uncorrupted even if they have undergone conformal deformations, such as compressions or shifts, as long as the effects of these deformations do not destroy the relevant structures of interest. This means that the defining spatial volume may be only geometrically valid for an instant of time for which it was declared, and undergo before and after deformations. In some cases, it may be possible to calculate the initial volume at the time of solidification, for instance for petrified bones compressed in Jurassic layers.
subclass of: Rigid Physical Feature

Position Determination
type: Class
comment: This class comprises activities of determining the actual position of some instance of S15 Observable Entity in space and time by measuring the necessary parameters sufficient for calculating this position. In the case of a material item, the determined position is intended to approximate a part or all of the extent of the presence (instance of E93 Presence) of an instance of the S15 Observable Entity of interest, such as the outer walls of an excavated settlement, the position of a ship sailing or the start and/or end of an athlete's run in a competition. Characteristically, a theodolite or GPS device may be positioned on some persistent feature. Determining the position of the device will yield an approximation of the position of the feature of interest at that time. Alternatively, some material item may be observed moving through a previously determined position at a given time. In case of determining the position of an Event, the approximated position pertains to areas in the spatiotemporal extent of the Event. This class is not a subclass of S21 Measurement because a position determination normally has to measure more than one dimension. Typically, a position determination consists of a combination of measurements of multiple associated distances and/or angles (instances of E54 Dimension) from a particular spot to certain reference points with previously known position in the same reference space. In some cases, a constituting spatial distance is given by a directed speed and the temporal distance measured from starting from a known position to the actual position, for instance what is registered in a standard log book entry. A particular role is played by the Earth's magnetic field and rotational axis as reference for an angle or direction. Often, the constituting dimensions observed within the context of an instance of S23 Position Determination are not explicitly documented, or hidden in an electronic device ’s software. Nevertheless, they constitute parts o…
subclass of: Observation

Sample Splitting
type: Class
comment: This class comprises the activity of dividing an instance of S13 Sample into new instances of S13 Sample. This activity describes cases of sub-sampling where the resulting instance maintains the characteristic qualities of the original instance. Any observations of these qualities made on the new instance also apply to the original one. This class should be used to model cases of splitting a homogenous sample into multiple ones.
subclass of: Sample Taking

Relative Dimension
type: Class
comment: This class comprises quantifiable properties that can be measured by some calibrated means and were holding between two or more distinct instances of S15 Observable Entity for some time. Typical examples include relative distances between physical things or temporal distances between events such as athletes arriving at a goal or the time elapsed from production in thermoluninescence dating. Generally, all kinds of quantifiable properties holding for a single item in isolation can be compared relative to the same of another item. Depending on the methods, such relative dimensions often constitute important primary observational data for calculating absolute values rather than being computational results from absolute values, an example being relative barometric measurements of altitude during expeditions.
subclass of: E54 Dimension

Angle
type: Class
comment: This class comprises quantifiable angles that can be measured by some calibrated means and held between a spot on some instance of S15 Observable Entity forming the geometric vertex and two directions to the position of some other instances of S15 Observable Entity. Typical examples include results of measurements with theodolites, sextants or compasses.
subclass of: Relative Dimension

Observation
type: Class
comment: This class comprises activity of gaining scientific knowledge about particular states of physical reality through empirical evidence, experiments and measurements. We define observation in the sense of natural sciences, as a kind of human activity: at some place and within some time-span, certain physical things and their behaviour and interactions are observed by human sensory impression, and often enhanced by tools and measurement devices. Observed situations or dimensions may pertain to properties confined to a single instance of S15 Observable Entity or pertain to constellations of multiple instances and relations between them, in particular distances between them. The output of the internal processes of measurement devices that do not require additional human interaction are in general regarded as part of the observation and not as additional inference. Primary data from measurement devices are regarded in this model to be results of observation and can be interpreted as propositions believed to be true within the (known) tolerances and degree of reliability of the device. Measurements and witnessing of events are special cases of observations. Observations result in a belief that certain propositions held at a time within the time-span of the observation. In this model, the degree of confidence in the observed properties is regarded to be “true” by default, but could be described differently by adding a property P3 has note to an instance of S4 Observation.
subclass of: I1 Argumentation

Observable Situation
type: Class
comment: An instance of S28 Observable Situation can be perceived as a set of formal propositions deriving from an observation event on a constellation, an interaction or a dynamic behaviour of instances of S15 Observable Entity, or sections of these instances within a particular time-span and spatial extent that lie in the past. The observation event in question either relies on human senses, or it has been enhanced or mediated by technical instruments. The observer may be directly involved themselves, or they may be receiving signals from each observation. The focus of the observer determines the model they overlay on the observed reality, in order to describe it in terms of distinct properties and value ranges of parameters. The latter selection and projection from reality constitutes the content of a particular instance of S28 Observable Situation. Multiple observers may select different models, details and value systems to the same spatiotemporal area (i.e., views they pay attention to). Consequently, the observed situations may differ, but should, in principle, be comparable to a common reality in their overlaps.
subclass of: I11 Situation

Observable Proposition
type: Class
comment: This class comprises proposition sets containing exactly one binary proposition which is, or could, in principle, be, encoded in a knowledge representation language, and which characterizes an observable phenomenon, regardless of whether it has happened or not. For example, it could refer to the intended meaning of a text about an observable phenomenon, where the belief value concerning its reality has not been asserted, or to the question of whether a certain situation has ever happened. The identity of an instance of S29 Observable Proposition is given by the totality of its content, whatever its encoding. The class S29 Observable Proposition plays the role of an important logical interface between observing single propositions and more generally observable situations. It is particularly relevant for implementing effective queries. For documentation, the use of the simpler shortcut properties of S4 Single Observation, i.e. O35 observed entity (was observed by), O9 observed property type (property type was observed by) and O16 observed value (value was observed by) will, typically, be the preferred approach.
subclass of: I17 One-Proposition Set
subclass of: Observable Situation

diminished
type: Property
comment: This property associates an instance of S1 Matter Removal with the instance of S10 Material Substantial that this activity diminished. Although an instance of S1 Matter Removal activity normally concerns only one item of S10 Material Substantial, it is possible to imagine circumstances under which more than one item might be diminished by a single Matter Removal activity. An instance S1 Matter Removal activity requires to diminish at least one item of S10 Material Substantial. This may be documented by any of the subproperties of O1 diminished (was diminished by) . Therefore, the instantiation of a particular subproperty of O1 diminished (was diminished by) is not necessary.
domain: Matter Removal
range: Material Substantial
inverse of: was diminished by

was diminished by
type: Property
domain: Material Substantial
range: Matter Removal
inverse of: diminished

removed
type: Property
comment: This property associates an instance of S1 Matter Removal with the instance of S11 Amount of Matter that it has removed.
domain: Matter Removal
range: Amount of Matter
inverse of: was removed by

was removed by
type: Property
domain: Amount of Matter
range: Matter Removal
inverse of: removed

sampled from
type: Property
comment: This property associates an instance of S2 Sample Taking with the instance S10 Material Substantial from which a sample was taken. In particular, it may be a feature or a fluid body from which a sample was removed.
domain: Sample Taking
range: Material Substantial
inverse of: was sample by

was sample by
type: Property
domain: Material Substantial
range: Sample Taking
inverse of: sampled from

sampled at
type: Property
comment: This property associates an instance of S2 Sample Taking with the instance of E53 Place ("spot") at which this activity sampled. It identifies the narrowest relevant area on the material substantial from which the sample was taken. This may be known or given in absolute terms or relative to an instance of the material substantial from which it was taken. If samples are taken from more than one spot, the sample taking activity must be documented by separate instances for each spot. The property P7 took place at (witnessed) , inherited from E4 Period, describes the position of the area in which the sampling activity occurred; this latter comprises the space within which operators and instruments were contained during the activity, and the sample taking spot.
domain: Sample Taking
range: E53 Place
inverse of: was sampling location of

was sampling location of
type: Property
domain: E53 Place
range: Sample Taking
inverse of: sampled at

removed
type: Property
comment: This property associates an instance of S2 Sample Taking with the instance of S13 Sample that was taken during the activity.
domain: Sample Taking
range: Sample
sub property of: removed
inverse of: was removed by

was removed by
type: Property
domain: Sample
range: Sample Taking
sub property of: was removed by
inverse of: removed

is former or current part of
type: Property
comment: This property associates an instance of S12 Amount of Fluid with an instance of S14 Fluid Body which formed or forms part of it. It allows instances of S14 Fluid Body to be analysed into elements of S12 Amount of Fluid.
domain: Amount of Fluid
range: Fluid Body
sub property of: contains
inverse of: has former or current part

has former or current part
type: Property
domain: Fluid Body
range: Amount of Fluid
sub property of: is contained in
inverse of: is former or current part of

confines
type: Property
comment: This property associates an instance of S20 Rigid Physical Feature with an instance of S10 Material Substantial that it partially or completely confines. It describes cases in which rigid features such as stratigraphic layers, walls, dams, riverbeds, etc. form the boundaries of some item such as another stratigraphic layer or the waters of a river.
domain: Rigid Physical Feature
range: Material Substantial
inverse of: is confined by

is confined by
type: Property
domain: Material Substantial
range: Rigid Physical Feature
inverse of: confines

observed
type: Property
comment: This property associates an instance of S4 Single Observation with one instance of S15 Observable Entity that was observed. Specifically, it describes that a thing, a feature, a phenomenon or some process is observed by an activity of Observation. This property is a strong shortcut of the fully developed path from S4 Single Observation through O37 expressed the observed as observable proposition (was observable proposition characterized by) , S29 Observable Proposition, O38 has domain (is domain of) , to S15 Observable Entity.
domain: Single Observation
range: Observable Entity
sub property of: P140 assigned attribute to
sub property of: observed entity
inverse of: was observed by

was observed by
type: Property
domain: Observable Entity
range: Single Observation
sub property of: P140i was attributed by
sub property of: was observed by
inverse of: observed

observed property type
type: Property
comment: This property associates an instance of S1 Matter Removal with the instance of S10 Material Substantial that this activity diminished. Although an instance of S4 Single Observation with the instance of S9 Property Type for which the observation provides a value or evidence, such as ‘concentration of nitrate’ observed in the water from a particular borehole. Encoding the observed property by type, observed entity and value (namely, properties O9, O37, and O16, respectively), is a method to circumscribe the reification of the observed property by the respective instance of S4 Single Observation. In an RDFS encoding, this circumscription can be transformed into an explicit representation of the observed property in terms of a formal ontology, either by the use of a reification construct or a Named Graph containing the observed property. The latter representation allows for more formal reasoning with the model, the former is more flexible about the kinds of observations. This property is a strong shortcut of the fully developed path from S4 Single Observation through O37 expressed the observed as observable proposition (was observable proposition characterized by) , S29 Observable Proposition, J32 has property type (is property type of) , to S9 Property Type.
domain: Single Observation
range: Property Type
sub property of: P177 assigned property of type
inverse of: property type was observed by

property type was observed by
type: Property
domain: Property Type
range: Single Observation
sub property of: P177i is type of property assigned
inverse of: observed property type

assigned dimension
type: Property
comment: This property associates an instance of S6 Data Evaluation with an instance of E54 Dimension that a data evaluation activity has assigned. In that case, dimensions may be determined by making evaluations on observational data based on mathematical inference rules and calculations.
domain: Data Evaluation
range: E54 Dimension
inverse of: dimension was assigned by

dimension was assigned by
type: Property
domain: E54 Dimension
range: Data Evaluation
inverse of: assigned dimension

described
type: Property
comment: This property associates an instance of S6 Data Evaluation with an instance of S15 Observable Entity for which a data evaluation activity provides a description. This description of any Observable Entity is based on data evaluations.
domain: Data Evaluation
range: Observable Entity
inverse of: was described by

was described by
type: Property
domain: Observable Entity
range: Data Evaluation
inverse of: described

has dimension
type: Property
comment: This property associates an instance of S15 Observable Entity with an instance of E54 Dimension that the observable entity has. It offers no information about how and when an E54 Dimension was established. Most instances of E54 Dimension pertain to one item only. An instance of E54 Dimension referred to by more than one item via this property or a specialization of it is more specifically an instance of S25 Relative Dimension, such as a distance between two physical objects. In the case of S25 Relative Dimension the property is equivalent to O33i has relative dimension (is relative to) . In case the instance of S15 Observable Entity is more specifically an instance of S10 Material Substantial and the instance of E54 Dimension is not an instance of S25 Relative Dimension, using the property O12 has dimension (is dimension of) is equivalent to using the property P43 has dimension (is dimension of) . In other words, using the one implies the other. This property is a shortcut of the fully developed path from S15 Observable Entity through O24i was measured by (measured) , S21 Measurement, O39 observed dimension (was observed in) , to E54 Dimension. Referring to an instance of E54 Dimension by this property is mutually exclusive to using either property P191 had duration (was duration of) or P179 had sales price (was sales price) to refer to the same instance of E54 Dimension. This broadens the same rule for P43 has dimension (is dimension of) .
domain: Observable Entity
range: E54 Dimension
inverse of: is dimension of

is dimension of
type: Property
domain: E54 Dimension
range: Observable Entity
inverse of: has dimension

triggered
type: Property
comment: This property associates an instance of E5 Event that triggered another instance of E5 Event with the latter. It identifies the interaction between events: an event can activate (trigger) other events in a target system that is in a situation of sustained tension, such as a trap or an unstable mountain slope giving way to a land slide after a rain or earthquake The distinction of a triggering event A from the triggered event B lies in their difference of nature. The starting of B is the result of an interaction of material constituents of A with material constituents of B. However, B does not necessarily continue the kinds of processes of A. Therefore, the triggering event A must spatiotemporally overlap with the initial time and area of the triggered event B. Any subsequent phenomena must initiate from this area and time and not from multiple independent areas.
domain: E5 Event
range: E5 Event
inverse of: was triggered by

was triggered by
type: Property
domain: E5 Event
range: E5 Event
inverse of: triggered

occupied
type: Property
comment: This property associates an instance of S10 Material Substantial with the instance of E53 Place that this substance occupied. It describes the space filled (occupied) by a physical matter. This property is the development of the shortcut expressed in the proposition of classification: “S20 Physical Feature” isA “E53 Place”. This property is equivalent to P156 occupies (is occupied by) with domain E18 Physical Thing and range E53 Place.
domain: Material Substantial
range: E53 Place
inverse of: was occupied by

was occupied by
type: Property
domain: E53 Place
range: Material Substantial
inverse of: occupied

observed value
type: Property
comment: This property associates a value assigned to an entity observed by S4 Single Observation. This property is a strong shortcut of the fully developed path from S4 Single Observation through O37 expressed the observed as observable proposition (was observable proposition characterized by) , S29 Observable Proposition, J31 has range (is range of) , to E1 CRM Entity.
domain: Single Observation
range: E1 CRM Entity
sub property of: P141 assigned
inverse of: value was observed by

value was observed by
type: Property
domain: E1 CRM Entity
range: Single Observation
sub property of: P141i was assigned by
inverse of: observed value

generated
type: Property
comment: This property associates an instance of S17 Physical Genesis event with an instance of E18 Physical Thing that the event generated.
domain: Physical Genesis
range: E18 Physical Thing
sub property of: altered
inverse of: was generated by

was generated by
type: Property
domain: E18 Physical Thing
range: Physical Genesis
sub property of: was altered by
inverse of: generated

altered
type: Property
comment: This property associates an instance of S18 Alteration process with an instance of E18 Physical Thing which was altered by this activity.
domain: Alteration
range: E18 Physical Thing
inverse of: was altered by

was altered by
type: Property
domain: E18 Physical Thing
range: Alteration
inverse of: altered

encountered object
type: Property
comment: This property associates an instance of S19 Encounter Event with an instance of E18 Physical Thing that was encountered or observed as present during the event.
domain: Encounter Event
range: E18 Physical Thing
sub property of: P12 occurred in the presence of
inverse of: was object encountered through

was object encountered through
type: Property
domain: E18 Physical Thing
range: Encounter Event
sub property of: P12i was present at
inverse of: encountered object

sampled from type of part
type: Property
comment: This property associates the activity of a Sample Taking with the type of the location part from which a sample was taken. It is a shortcut of the property O4 sampled at (was sampling location of) , and it is used as an alternative property, identifying features and material substantial as types of parts of sampling positions.
domain: Sample Taking
range: E55 Type
inverse of: type of part was sampled by

type of part was sampled by
type: Property
domain: E55 Type
range: Sample Taking
inverse of: sampled from type of part

encountered at
type: Property
comment: This property associates an instance of S19 Encounter Event with an instance of E53 Place at which the things, which were encountered, were observed to be present. This may be given in absolute terms or in terms relative to the observed thing. The associated place must be within the boundaries of the E53 Place at which the S19 Encounter Event took place, if that has been given. Note, that the encountered object may be larger and extend beyond the place of encounter, such as a corner of a building being excavated.
domain: Encounter Event
range: E53 Place
inverse of: witnessed encounter

witnessed encounter
type: Property
domain: E53 Place
range: Encounter Event
inverse of: encountered at

is defined by
type: Property
comment: This property identifies the E92 Spacetime Volume that defines a S22 Segment of Matter. The spatial boundaries of the E92 Spacetime Volume are defined through S4 Single Observation or declaration while the temporal boundaries are confined by S18 Alteration events.
domain: Segment of Matter
range: E92 Spacetime Volume
inverse of: defines

defines
type: Property
domain: E92 Spacetime Volume
range: Segment of Matter
inverse of: is defined by

measured
type: Property
comment: This property associates an instance of S21 Measurement with an instance of S15 Observable Entity to which it applied. An instance of S15 Observable Entity may be measured more than once. Material things and processes may be measured, e.g. the number of words in a copy of a text, or the duration of an event. An instance of S21 Measurement may measure a specific constellation of distinct instances of S15 Observable Entity at some time, to determine a dimension holding between the latter, i.e. an instance of S25 Relative Dimension. This property is part of the fully developed path from S15 Observable Entity through O24i was measured by (measured) , S21 Measurement, O39 observed dimension (was observed in) , to E54 Dimension, which is shortcut by O12 has dimension (is dimension of) .
domain: Measurement
range: Observable Entity
sub property of: observed entity
inverse of: was measured by

was measured by
type: Property
domain: Observable Entity
range: Measurement
sub property of: was observed by
inverse of: measured

contains
type: Property
comment: This property describes that an instance of S10 Material Substantial was or is contained in another instance of S10 Material Substantial regardless of whether the identity of the involved instances is based on the persistence of the form of material or on material substance that may change form.
domain: Material Substantial
range: Material Substantial
inverse of: is contained in

is contained in
type: Property
domain: Material Substantial
range: Material Substantial
inverse of: contains

split
type: Property
comment: This property associates an instance of S24 Sample Splitting with the instance of S13 Sample which is the original sample being split.
domain: Sample Splitting
range: Sample
sub property of: sampled from
inverse of: was source for

was source for
type: Property
domain: Sample
range: Sample Splitting
sub property of: was sample by
inverse of: split

is conceptually greater than
type: Property
comment: This property associates an instance of E55 Type from a particular concept scheme or vocabulary to be declared as having an order relative to other instances of E55 Type in the same or other concept schemes, without necessarily having a specific value associated with either instance. This allows, for example, for an E55 Type instance representing the concept of "good" in a conservation report vocabulary to be greater than the E55 Type instance representing the concept of "average" in the same vocabulary. This property is transitive, and thus if "average" is greater than "poor", then "good" is also greater than "poor". In the domain of statistics, types that participate in this kind of relationship are called "Ordinal Variables"; as opposed to those without order which are called "Nominal Variables". This property allows for queries that select based on the relative position of participating E55 Types.
domain: E55 Type
range: E55 Type
inverse of: is conceptually less than

is conceptually less than
type: Property
domain: E55 Type
range: E55 Type
inverse of: is conceptually greater than

removed sub-sample
type: Property
comment: This property associates an instance of S24 Sample Splitting with the resulting instance of S13 Sample that has been removed from the original sample. The new sample (i.e. the sub-sample) maintains the characteristic qualities of the original.
domain: Sample Splitting
range: Sample
sub property of: removed
inverse of: was sub-sample removed by

was sub-sample removed by
type: Property
domain: Sample
range: Sample Splitting
sub property of: was removed by
inverse of: removed sub-sample

determined position
type: Property
comment: This property associates an instance of S23 Position Determination with an instance of E94 Space Primitive that is the result of calculating or concluding an actual position as an integral part of the activity of determining the position. In case the calculation is done later in another context, it should be regarded as the result of a distinct instance of S6 Data Evaluation. The instance of E94 Space Primitive approximates the place occupied by the entity whose position is being determined by the constituting observations.
domain: Position Determination
range: Literal

has validity time-span
type: Property
comment: This property associates an instance of S23 Position Determination with the instance of E52 Time-Span for which the determination is valid according to the observer at the time of the observation. No inferences can be made in relation to the validity of the determination outside this time-span, despite the fact that some entities are relatively stable, and their positions may remain the same after the determination within the relevant precision. The time-span of validity should fall within the overall time-span of the process of determination. This property should be instantiated if the overall time-span of the process of determination is not sufficiently precise for the purpose and precision of the determination. An example would be the time that a ship reached an assumed position after running for a measured temporal duration with a measured speed and direction from a known position.
domain: Position Determination
range: E52 Time-Span
sub property of: P4 has time-span
inverse of: is time-span validity for

is time-span validity for
type: Property
domain: E52 Time-Span
range: Position Determination
sub property of: P4i is time-span of
inverse of: has validity time-span

determined position of
type: Property
comment: This property associates an instance of S23 Position Determination with the instance of S15 Observable Entity whose position is being determined.
domain: Position Determination
range: Observable Entity
sub property of: observed entity
inverse of: was located by

was located by
type: Property
domain: Observable Entity
range: Position Determination
sub property of: was observed by
inverse of: determined position of

is relative to
type: Property
comment: This property associates an instance of S25 Relative Dimension with one of the instances of S15 Observable Entity between which it was holding.
domain: Relative Dimension
range: Observable Entity
sub property of: is dimension of
inverse of: has relative dimension

has relative dimension
type: Property
domain: Observable Entity
range: Relative Dimension
sub property of: has dimension
inverse of: is relative to

has vertex
type: Property
comment: This property associates an instance of S26 Angle with the instance of S15 Observable Entity that includes in its extent the vertex of the former. Typical examples are respective marked spots on Earth or a ship where a theodolite (‘Theodolite’, 2025), a sextant (‘Sextant’, 2025), or a compass is positioned during a position measurement.
domain: Angle
range: Observable Entity
sub property of: is relative to
inverse of: is vertex of

is vertex of
type: Property
domain: Observable Entity
range: Angle
sub property of: has relative dimension
inverse of: has vertex

observed entity
type: Property
comment: This property associates an instance of S27 Observation with one of the instances of S15 Observable Entity that were observed. Specifically, it describes that a thing, a feature, a phenomenon, or some process, is observed by an activity of S27 Observation. This property is a strong shortcut for the detailed path from S27 Observation through O36 expressed the observed as (was the expression of) , S28 Observable Situation, O40 refers to observable entity (is referred to in), to S15 Observable Entity.
domain: Observation
range: Observable Entity
inverse of: was observed by

was observed by
type: Property
domain: Observable Entity
range: Observation
inverse of: observed entity

expressed the observed as
type: Property
comment: This property associates an instance of Observation with an instance of S28 Observable Situation that the actors carrying out the observation used to express the observed phenomena of their interests. The alleged time-span of the observed situation must be equal to or within the overall time-span of the domain instance used for this property. A narrower time-span of validity for the observed situation can be documented via the property S28 Observable Situation. J24 held at least for (is at least validity of) : E52 Time-Span. This property is a strong shortcut for the path from S27 Observation through J2 concluded that (was concluded by) , I2 Belief, J4 that (is subject of) , S28 Observable Situation, J5 holds to be , to I6 Belief Value (= “True”).
domain: Observation
range: Observable Situation
inverse of: was the expression of

was the expression of
type: Property
domain: Observable Situation
range: Observation
inverse of: expressed the observed as

expressed the observed as observable proposition
type: Property
comment: This property associates an instance of S4 Single Observation with the instance of S29 Observable Proposition that the actors carrying out the observation used to express the observed phenomenon of interest. This property forms a logical interface between observing single propositions or more generally observable situations. It is particularly relevant for implementing effective queries. For documentation, the use of the simpler shortcut properties, i.e., O8 observed (was observed by), O9 observed property type (property type was observed by) , and O16 observed value (value was observed by) will typically be the preferred approach. The property is part of the fully developed path from S4 Single Observation through O37 expressed the observed as observable proposition (was observable proposition characterized by) , S29 Observable Proposition, O38 has domain (is domain of) , S15 Observable Entity, which is shortcut by O8 observed (was observed by) . The property is part of the fully developed path from S4 Single Observation through O37 expressed the observed as observable proposition (was observable proposition characterized by) , S29 Observable Proposition, J31 has range (is range of) , E1 CRM Entity, which is shortcut by O16 observed value (value was observed by) . The property is part of the fully developed path from S4 Single Observation through O37 expressed the observed as observable proposition (was observable proposition characterized by) , S29 Observable Proposition, J32 has property type (is property type of) , E55 Type, which is shortcut by O9 observed property type (property type was observed by) .
domain: Single Observation
range: Observable Proposition
sub property of: J33 assigned propositions
sub property of: expressed the observed as
inverse of: was observable proposition characterized by

was observable proposition characterized by
type: Property
domain: Observable Proposition
range: Single Observation
sub property of: J33i is assigned by
sub property of: was the expression of
inverse of: expressed the observed as observable proposition

has domain
type: Property
comment: This property associates an instance of S29 Observable Proposition with an instance of S15 Observable Entity that must appear as the only domain instance of the proposition in the content of the former. This property is part of the fully developed path from S4 Observation through O37 expressed the observed as observable proposition (was observable proposition characterized by) , S29 Observable Proposition, O38 has domain (is domain of) , SO15 Observable Entity, which is shortcut by O8 observed (was observed by) .
domain: Observable Proposition
range: Observable Entity
sub property of: J30 has domain
sub property of: refers to observable entity
inverse of: is domain of

is domain of
type: Property
domain: Observable Entity
range: Observable Proposition
sub property of: J30i is domain of
sub property of: is referred to in
inverse of: has domain

observed dimension
type: Property
comment: This property records the dimension of an instance of S15 Observable Entity or a specific constellation of such instances that was observed in an instance of S21 Measurement. The observed items should be documented using the property O24 measured (was measured by) . One measurement activity may determine only one dimension of an instance of S15 Observable Entity or a specific constellation of such instances. Such a dimension may be any observable and quantifiable aspect of the latter. Weight, length, spatial or temporal distances are characteristic kinds of dimensions in this sense. A dimension of one or more instances of S15 Observable Entity may be determined either by direct observation or using recorded evidence. However, determination by measuring requires the presence of the measured items. Other methods may constitute other kinds of instances of I1 Argumentation. Even though knowledge of the value of a dimension requires measurement, the dimension may be an object of discourse prior to, or even without, any measurement being made. This property is a part of the fully developed path from S15 Observable Entity through O24i was measured by (measured) , S21 Measurement, O39 observed dimension (was observed in) to E54 Dimension. In case the instance of S21 Measurement is more specifically an instance of E16 Measurement, the instance of E54 Dimension cannot be an instance of S25 Relative Dimension and using the property O39 observed dimension (was observed in) is equivalent to using the property P40 observed dimension (was observed in) . In other words, using the one implies the other. Referring to an instance of E54 Dimension by this property is mutually exclusive to using either property P191 had duration (was duration of) or P179 had sales price (was sales price) to refer to the same instance of E54 Dimension. This follows from the same rule as for O12 has dimension (is dimension of) , in the same way as for P40 observed dimension (was observed in) and P43 has d…
domain: Measurement
range: E54 Dimension
inverse of: was observed in

was observed in
type: Property
domain: E54 Dimension
range: Measurement
inverse of: observed dimension

refers to observable entity
type: Property
comment: This property associates an instance of S28 Observable Situation with an instance of S15 Observable Entity that appears as an element of one or more propositions in the content of the former. This property serves on one side to relate an instance of S28 Observable Situation to other contexts of interest, in particular when its content is or cannot be represented as a Named Graph in the same knowledge base. On the other hand, it plays a structural role in this model for expressing a minimal formal constraint for the observability of what is referred by an instance of S28 Observable Situation. This property is part of the fully developed path from S4 Observation through O37 expressed the observed as observable proposition (was observable proposition characterized by) , S29 Observable Proposition, O38 has domain (is domain of) , to S15 Observable Entity, which is strongly shortcut by O8 observed (was observed by) .
domain: Observable Situation
range: Observable Entity
sub property of: J28 contains entity reference
inverse of: is referred to in

is referred to in
type: Property
domain: Observable Entity
range: Observable Situation
sub property of: J28i is referred to in
inverse of: refers to observable entity

measured dimension
type: Property
comment: This property associates an instance of S23 Position Determination with an instance of S25 Relative Dimension that was the result of a measurement carried out as part of the activity of determining the position in order to obtain or complete the necessary information for determining the position, such the distances of the item to be determined from two immobile items with known position, or the compass directions of two light-houses (angles with the Earth’s magnetic field ) a s seen from a boat for determining the boat’s position. Only the time-critical measurements need to be carried out of as part of the actual domain instance of this property, such as the time elapsed at which an athlete meets a goal with a predetermined distance from the starting point. This property needs not be instantiated in cases in which the actual relative dimensions are not known to the user, such as the distances to the satellites when using GPS devices.
domain: Position Determination
range: Relative Dimension
inverse of: was measured in

was measured in
type: Property
domain: Relative Dimension
range: Position Determination
inverse of: measured dimension

used result of
type: Property
comment: This property associates an instance of S23 Position Determination with an instance of S27 Observation the results of which were part of the necessary constituting observations of the position determination but carried out earlier, in another context. Therefore, the observations must not be a critical component of the validity time-span of the position determination, such the measurement of the distance between the start and the finish line in a 100m sprint race competition. In contrast, the measurement of the elapsed time an athlete reaches the finish line needs to fall within the time-span and be part of the domain instance of this property.
domain: Position Determination
range: Observation
inverse of: results contributed to

results contributed to
type: Property
domain: Observation
range: Position Determination
inverse of: used result of